{"text_format":"1","workbook":"xlsx","n_sheets":9,"sheets":["разн. списки","Сводные таблицы для меня","Таб 1.1-1.2","Ф1-3","Ф4 ПРОФЕССИИ","Ф5 СПЕЦИАЛЬНОСТИ","Ф6-9","Трудоустройство выпускников","диаграммы"],"not_rendered":{"charts":40,"images":0,"macros":1,"external_links":0,"defined_names":9,"comments":0,"pivot_tables":16},"unopened":[],"bounds":{"document_bytes":16777216,"sheet_cells":100000,"rows_first":2000,"rows_last":500,"rows_between":2000,"halvings":0,"cell_chars":16384,"cell_head_chars":4096},"cells_cut":0,"cells_raw":0,"read":"whole","date_system":"1900"}

{"sheet":"разн. списки","index":0,"n_rows":494,"n_cols":24,"rows_kept":494,"cut":false,"hidden":false,"merged":[]}
[null,null,null,null,null,null,null,null,"Список профессий",null,null,null,null,"Список специальностей"]
["Да",null,"Сведения внесены полностью"]
["Нет",null,"Сведения внесены частично",null,null,null,null,null,"05.01.01 Гидрометнаблюдатель","05.00.00 НАУКИ О ЗЕМЛЕ",null,null,null,"05.02.01 Картография","05.00.00 НАУКИ О ЗЕМЛЕ",null,null,null,null,null,null,null,"05.01.01 Гидрометнаблюдатель","проф"]
[null,null,"Сведения не внесены",null,null,null,null,null,"08.01.01 Изготовитель арматурных сеток и каркасов","08.00.00 ТЕХНИКА И ТЕХНОЛОГИИ СТРОИТЕЛЬСТВА",null,null,null,"05.02.02 Гидрология","05.00.00 НАУКИ О ЗЕМЛЕ",null,null,null,null,null,null,null,"08.01.01 Изготовитель арматурных сеток и каркасов","проф"]
[null,null,null,null,null,null,null,null,"08.01.02 Монтажник трубопроводов","08.00.00 ТЕХНИКА И ТЕХНОЛОГИИ СТРОИТЕЛЬСТВА",null,null,null,"05.02.03 Метеорология","05.00.00 НАУКИ О ЗЕМЛЕ",null,null,null,null,null,null,null,"08.01.02 Монтажник трубопроводов","проф"]
[null,null,null,null,null,null,null,null,"08.01.04 Кровельщик","08.00.00 ТЕХНИКА И ТЕХНОЛОГИИ СТРОИТЕЛЬСТВА",null,null,null,"07.02.01 Архитектура","07.00.00 АРХИТЕКТУРА",null,null,null,null,null,null,null,"08.01.04 Кровельщик","проф"]
[null,null,null,null,null,null,null,null,"08.01.05 Мастер столярно-плотничных и паркетных работ","08.00.00 ТЕХНИКА И ТЕХНОЛОГИИ СТРОИТЕЛЬСТВА",null,null,null,"08.02.01 Строительство и эксплуатация зданий и сооружений","08.00.00 ТЕХНИКА И ТЕХНОЛОГИИ СТРОИТЕЛЬСТВА",null,null,null,null,null,null,null,"08.01.05 Мастер столярно-плотничных и паркетных работ","проф"]
["Бюджет",null,null,null,null,null,null,null,"08.01.06 Мастер сухого строительства","08.00.00 ТЕХНИКА И ТЕХНОЛОГИИ СТРОИТЕЛЬСТВА",null,null,null,"08.02.02 Строительство и эксплуатация инженерных сооружений","08.00.00 ТЕХНИКА И ТЕХНОЛОГИИ СТРОИТЕЛЬСТВА",null,null,null,null,null,null,null,"08.01.06 Мастер сухого строительства","проф"]
["Внебюджет",null,null,null,null,null,null,null,"08.01.07 Мастер общестроительных работ","08.00.00 ТЕХНИКА И ТЕХНОЛОГИИ СТРОИТЕЛЬСТВА",null,null,null,"08.02.03 Производство неметаллических строительных изделий и конструкций","08.00.00 ТЕХНИКА И ТЕХНОЛОГИИ СТРОИТЕЛЬСТВА",null,null,null,null,null,null,null,"08.01.07 Мастер общестроительных работ","проф"]
[null,null,null,null,null,null,null,null,"08.01.08 Мастер отделочных строительных работ","08.00.00 ТЕХНИКА И ТЕХНОЛОГИИ СТРОИТЕЛЬСТВА",null,null,null,"08.02.04 Водоснабжение и водоотведение","08.00.00 ТЕХНИКА И ТЕХНОЛОГИИ СТРОИТЕЛЬСТВА",null,null,null,null,null,null,null,"08.01.08 Мастер отделочных строительных работ","проф"]
{"$rows_left_out":485}
{"sheet":"Сводные таблицы для меня","index":1,"n_rows":345,"n_cols":31,"rows_kept":345,"cut":false,"hidden":false,"merged":[[262,1,262,2],[2,18,2,19],[2,23,2,24],[2,28,2,29],[0,1,0,2],[2,1,2,2],[2,5,2,6],[2,9,2,10],[2,12,2,13]]}
[null,"Профессии"]
[]
[null,"Форма обучения",null,null,null,"Бюджет/внебюджет",null,null,null,"Кол-во профессий",null,null,"Вид и форма гиа",null,null,null,null,null,"Результаты защиты вкр",null,null,null,null,"Результаты защиты ГЭ",null,null,null,null,"Результаты защиты ГЭ"]
[null,"Названия строк","Сумма по полю Количество выпускников по профессии",null,null,"Названия строк","Сумма по полю Количество выпускников по профессии",null,null,"Названия строк","Сумма по полю Количество выпускников по профессии",null,"Сумма по полю Численность обучающихся, выполнявших  выпускную квалификационную работу в виде демонстрационного экзамена, чел.","Сумма по полю Численность обучающихся, выполнявших  выпускную квалификационную работу в виде выпускной практической квалификационной работы и письменной экзаменационной работы, чел.","Сумма по полю Численность обучающихся, выполнявших  выпускную квалификационную работу в виде выпускной практической квалификационной работы и письменной экзаменационной работы, при этом практическая квалификационная работа проводится в виде демонстрационного экзамена, ",null,null,null,"Сумма по полю отлично (ВКР)","Сумма по полю хорошо (ВКР)","Сумма по полю удовлетворительно (ВКР)","Сумма по полю Неудовлетворительно (ВКР)",null,"Сумма по полю отлично (ГЭ)","Сумма по полю хорошо (ГЭ)","Сумма по полю удовлетворительно (ГЭ)","Сумма по полю Неудовлетворительно (ГЭ)",null,"Названия строк","Сумма по полю Количество выпускников по профессии","Сумма по полю Количество студентов прошедших демонстрационный экзамен по каждой компетенции в рамках ГИА, чел."]
[null,"Заочная",40,null,null,"Бюджет",26,null,null,"05.01.01 Гидрометнаблюдатель",26,null,19,20,27,null,null,null,15,14,17,16,null,11,16,15,18,null,"05.01.01 Гидрометнаблюдатель",26,9]
[null,"Очная",13,null,null,"Внебюджет",40,null,null,"08.01.07 Мастер общестроительных работ",40,null,null,null,null,null,null,null,null,null,null,null,null,null,null,null,null,null,"08.01.07 Мастер общестроительных работ",40]
[null,"(пусто)",0,null,null,"(пусто)",0,null,null,"(пусто)",0,null,null,null,null,null,null,null,null,null,null,null,null,null,null,null,null,null,"(пусто)",0]
[null,"Очно-заочная",13,null,null,"Общий итог",66,null,null,"Общий итог",66,null,null,null,null,null,null,null,null,null,null,null,null,null,null,null,null,null,"Общий итог",66,9]
[null,"Общий итог",66]
[]
{"$rows_left_out":336}
{"sheet":"Таб 1.1-1.2","index":2,"n_rows":203,"n_cols":8,"rows_kept":203,"cut":false,"hidden":false,"merged":[[0,1,0,7],[5,1,6,1],[5,2,5,7],[1,1,1,4],[1,5,1,7],[2,1,2,4],[2,5,2,7]]}
[null,"Заполняются ТОЛЬКО ЗЕЛЕНЫЕ ЯЧЕЙКИ"]
[null,"НАИМЕНОВАНИЕ ОБРАЗОВАТЕЛЬНОЙ ОРГАНИЗАЦИИ",null,null,null,"Вместо этого текста, напишите название"]
[null,"ФИО ОТВЕТСТВЕННОГО ЗА ЗАПОЛНЕНИЕ/КОНТАКТНЫЕ ДАННЫЕ",null,null,null,"Вместо этого текста, напишите ФИО ответственного и контактные данные"]
[]
[null,"Таблица 1.1. Сравнительная таблица количественных показателей выпуска за период с 2018 по 2022 г. (Заполняет только головное учреждение за себя и за филиалы)"]
[null,"Учебный год","Состояние контингента"]
[null,null,"Общее количество выпускников, получивших дипломы, включая филиалы, при наличии), чел.","В том числе, общее количество выпускников, получивших дипломы, (только филиалы), чел.","В том числе, численность выпускников, получивших дипломы с отличием, чел.","В том числе, численность выпускников получивших дипломы по наиболее востребованным на рынке труда, новым и перспективным профессиям и специальностям, требующих среднего профессионального образования (Топ 50), чел.","В том числе, численность выпускников, получивших дипломы и прошедшие демонстрационный экзамен, чел.","В том числе, численность выпускников, получивших дипломы и прошедшие процедуру НОК, чел."]
[{"$f":"C8-D8","v":90},"2017/2018",100,10,1,300,1,100]
[{"$f":"C9-D9","v":108},"2018/2019",120,12,1,5,1,2]
[{"$f":"C10-D10","v":136},"2019/2020",150,14,1,5,2,3]
{"$rows_left_out":194}
{"sheet":"Ф1-3","index":3,"n_rows":21,"n_cols":17,"rows_kept":21,"cut":false,"hidden":false,"merged":[[1,0,1,16],[8,0,8,16],[2,15,2,16],[3,2,4,2],[3,3,3,5],[3,6,4,6],[3,7,3,11],[3,12,3,14],[3,15,4,15],[3,16,4,16],[2,0,4,0],[2,1,4,1],[2,2,2,5],[2,6,2,11],[2,12,2,14],[15,0,15,9],[9,15,9,16],[10,2,11,2],[10,3,10,5],[10,6,11,6],[10,7,10,11],[10,12,10,14],[10,15,11,15],[10,16,11,16],[9,0,11,0],[9,1,11,1],[9,2,9,5],[9,6,9,11],[9,12,9,14],[16,0,18,0],[16,1,17,2],[16,3,17,4],[16,5,17,8],[16,9,18,9]]}
[]
["Форма №1  Сведения о характеристике состава государственной экзаменационной комиссии по программам среднего профессионального образования по СПЕЦИАЛЬНОСТЯМ"]
["Наименование образовательной организации","Количество выпускников 2022 года по всем формам обучения, чел. (Автоматически подтягивается из Таб 1.2)","2.2.1. Председатель ГЭК",null,null,null,"2.2.2. Члены ГЭК",null,null,null,null,null,"2.2.3. Наименования предприятий (организаций), участвующих в работе ГЭК",null,null,"2.2.4.Информация о внесении членов ГЭК в базу кадровых ресурсов на цифровой платформе ЦОПП"]
[null,null,"Суммарно по всем комиссиям и формам обучения,  чел. \n(НЕ ЗАПОЛНЯЕТСЯ, СУММА СТОЛБЦОВ 4-6)","из них:",null,null,"Суммарно по всем комиссиям и формам обучения,  чел. (НЕ ЗАПОЛНЯЕТСЯ, СУММА СТОЛБЦОВ 8-11)","из них:",null,null,null,null,"из них:",null,null,"Всего внесено, чел.","В том числе экспертов Союза Ворлдскиллс"]
[null,null,null,"руководители/заместители руководителей, чел.","руководители структурных подразделений, чел.","прочие работники предприятий (организаций)",null,"представители работодателей / общественных союзов (ассоцийций), чел.","представители образовательных организаций, чел.","фрилансеры, самозанятые, ИП, чел","прочие работники предприятий (организаций), чел.","Из членов ГЭК (из столбца 7) эксперты Союза Ворлдскиллс вне зависимости от статуса, чел.","малые (среднесписочная численность сотрудников до 100 чел)","средние (среднесписочная численность сотрудников 101-250 чел)","крупные (среднесписочная численность сотрудников свыше 250 чел)"]
[1,2,3,4,5,6,7,8,9,10,11,12,13,14,15,16,17]
[{"$f":"'Таб 1.1-1.2'!$F$2","v":"Вместо этого текста, напишите название"},{"$f":"SUMIF('Таб 1.1-1.2'!$A$16:$A$202,\"спец\",'Таб 1.1-1.2'!$E$16:$E$202)","v":285},{"$f":"SUM(D7:F7)","v":12},2,4,6,{"$f":"SUM(H7:K7)","v":10},1,2,3,4,2,"ИП Григорьев","ООО Уралмедь","ООО ЕВРАЗ",1,1]
[]
["Форма №2  Сведения о характеристике состава государственной экзаменационной комиссии по программам среднего профессионального образования квалифицированных рабочих и служащих"]
["Наименование образовательной организации","Количество выпускников 2022 года по всем формам обучения, чел. (Автоматически подтягивается из Таб 1.2)","2.2.1. Председатель ГЭК",null,null,null,"2.2.2. Члены ГЭК",null,null,null,null,null,"2.2.3. Наименования предприятий (организаций), участвующих в работе ГЭК",null,null,"2.2.4.Информация о внесении членов ГЭК в базу кадровых ресурсов на цифровой платформе ЦОПП"]
{"$rows_left_out":12}
{"sheet":"Ф4 ПРОФЕССИИ","index":4,"n_rows":405,"n_cols":18,"rows_kept":405,"cut":false,"hidden":false,"merged":[[0,0,0,17],[1,8,1,15],[2,8,2,11],[2,12,2,15],[1,0,3,0],[1,2,3,2],[1,3,3,3],[1,16,3,16],[1,1,3,1],[1,4,3,4],[1,5,2,7],[1,17,3,17]]}
["ФОРМА №4 Виды и формы государственной итоговой аттестации по программам среднего профессионального образования по программам подготовки квалифицированных рабочих, служащих"]
["Код/Наименование профессии (выберите из списка)","Укрупненная группа (не заполняется)","Форма обучения (Выберите из списка)","Бюджет/Внебюджет (Выберите из списка)","Количество выпускников по профессии, допущенных и сдававших ГИА чел. (Не заполняется, сумма 7-9 столбцов)","Вид и форма ГИА ",null,null,"Результаты ГИА",null,null,null,null,null,null,null,"Наименование компетенции демонстрационного экзамена","Количество студентов прошедших демонстрационный экзамен по каждой компетенции в рамках ГИА, чел."]
[null,null,null,null,null,null,null,null,"Результаты защиты ВКР",null,null,null,"Результаты Государственного экзамена"]
[null,null,null,null,null,"Из столбца 6 Численность обучающихся, выполнявших  выпускную квалификационную работу в виде демонстрационного экзамена, чел.","Из столбца 6 Численность обучающихся, выполнявших  выпускную квалификационную работу в виде выпускной практической квалификационной работы и письменной экзаменационной работы","Из столбца 6 Численность обучающихся, выполнявших  выпускную квалификационную работу в виде выпускной практической квалификационной работы и письменной экзаменационной работы, при этом практическая квалификационная работа проводится в виде демонстрационного экзамена","отлично","хорошо","удовлетворительно ","Неудовлетворительно ","отлично","хорошо","удовлетворительно ","Неудовлетворительно "]
[1,2,3,4,5,6,7,8,9,10,11,12,13,14,15,16,17,18]
["1","Укрупненная группа","Форма обучения","Бюджет/Внебюджет","Количество выпускников по профессии","Численность обучающихся, выполнявших  выпускную квалификационную работу в виде демонстрационного экзамена, чел.","Численность обучающихся, выполнявших  выпускную квалификационную работу в виде выпускной практической квалификационной работы и письменной экзаменационной работы, чел.","Численность обучающихся, выполнявших  выпускную квалификационную работу в виде выпускной практической квалификационной работы и письменной экзаменационной работы, при этом практическая квалификационная работа проводится в виде демонстрационного экзамена, ","отлично (ВКР)","хорошо (ВКР)","удовлетворительно (ВКР)","Неудовлетворительно (ВКР)","отлично (ГЭ)","хорошо (ГЭ)","удовлетворительно (ГЭ)","Неудовлетворительно (ГЭ)","Наименование компетенции демонстрационного экзамена","Количество студентов прошедших демонстрационный экзамен по каждой компетенции в рамках ГИА, чел."]
["05.01.01 Гидрометнаблюдатель",{"$f":"IF(ISBLANK(A7),\"\",VLOOKUP(A7,'разн. списки'!$I$3:$J$222,2,FALSE))","v":"05.00.00 НАУКИ О ЗЕМЛЕ"},"Очная","Бюджет",{"$f":"SUM(F7:H7)","v":13},4,4,5,1,4,7,6,4,5,2,3,null,4]
["08.01.07 Мастер общестроительных работ",{"$f":"IF(ISBLANK(A8),\"\",VLOOKUP(A8,'разн. списки'!$I$3:$J$222,2,FALSE))","v":"08.00.00 ТЕХНИКА И ТЕХНОЛОГИИ СТРОИТЕЛЬСТВА"},"Заочная","Внебюджет",{"$f":"SUM(F8:H8)","v":40},10,15,15,10,5,6,4,3,4,5,6]
["05.01.01 Гидрометнаблюдатель",{"$f":"IF(ISBLANK(A9),\"\",VLOOKUP(A9,'разн. списки'!$I$3:$J$222,2,FALSE))","v":"05.00.00 НАУКИ О ЗЕМЛЕ"},"Очно-заочная","Бюджет",{"$f":"SUM(F9:H9)","v":13},5,1,7,4,5,4,6,4,7,8,9,null,5]
[null,{"$f":"IF(ISBLANK(A10),\"\",VLOOKUP(A10,'разн. списки'!$I$3:$J$222,2,FALSE))","v":""},null,null,0]
{"$rows_left_out":396}
{"sheet":"Ф5 СПЕЦИАЛЬНОСТИ","index":5,"n_rows":573,"n_cols":20,"rows_kept":573,"cut":false,"hidden":false,"merged":[[0,0,0,19],[1,19,3,19],[1,10,1,17],[2,10,2,13],[2,14,2,17],[2,7,3,7],[2,8,3,8],[1,5,1,8],[1,9,3,9],[1,18,3,18],[1,4,3,4],[2,5,3,5],[2,6,3,6],[1,0,3,0],[1,1,3,1],[1,2,3,2],[1,3,3,3]]}
["ФОРМА №5 Виды и формы государственной итоговой аттестации по программам среднего профессионального образования по программам специалистов среднего звена"]
["Код/Наименование специальности (выберите из списка)","Укрупненная группа (не заполняется)","Форма обучения (Выберите из списка)","Бюджет/Внебюджет (Выберите из списка)","Количество выпускников по специальности, допущенных и сдававших ГИА, чел (Не заполнять сумма столбцов 7-10)","Вид и форма ГИА ",null,null,null,"Численность обучающихся, сдававших государственный экзамен, чел.","Результаты ГИА",null,null,null,null,null,null,null,"Наименование компетенции демонстрационного экзамена","Количество студентов прошедших демонстрационный экзамен по каждой компетенции в рамках ГИА, чел."]
[null,null,null,null,null,"Численность обучающихся, выполнявших   выпускную квалификационную работу в виде дипломной работы (дипломного проекта), чел.","Численность обучающихся, выполнявших   выпускную квалификационную работу в виде дипломной работы (дипломного проекта) и демонстрационного экзамена, чел.","Численность обучающихся, выполнявших   выпускную квалификационную работу в виде дипломной работы (дипломного проекта) и сдававших государственный экзамен, чел.","Численность обучающихся, выполнявших   выпускную квалификационную работу в виде дипломной работы (дипломного проекта) и сдававших государственный экзамен в виде демонстрационного экзамена, чел.",null,"Результаты защиты ВКР",null,null,null,"Результаты Государственного экзамена"]
[null,null,null,null,null,null,null,null,null,null,"отлично (ВКР)","хорошо (ВКР)","удовлетворительно (ВКР)","Неудовлетворительно (ВКР)","отлично (ГЭ)","хорошо","удовлетворительно ","Неудовлетворительно "]
[1,2,3,4,5,6,7,8,9,10,11,12,13,14,15,16,17,18,19,20]
["Код/Наименование специальности","Укрупненная группа","Форма обучения","Бюджет/Внебюджет","Количество выпускников по специальности, чел","Численность обучающихся, выполнявших   выпускную квалификационную работу в виде дипломной работы (дипломного проекта), чел.","Численность обучающихся, выполнявших   выпускную квалификационную работу в виде дипломной работы (дипломного проекта) и демонстрационного экзамена, чел.","Численность обучающихся, выполнявших   выпускную квалификационную работу в виде дипломной работы (дипломного проекта) и сдававших государственный экзамен, чел.","Численность обучающихся, выполнявших   выпускную квалификационную работу в виде дипломной работы (дипломного проекта) и сдававших государственный экзамен в виде демонстрационного экзамена, чел.","Численность обучающихся, сдававших государственный экзамен, чел.","отлично (ВКР)","хорошо (ВКР)","удовлетворительно (ВКР)","Неудовлетворительно (ВКР)","отлично (ГЭ)","хорошо (ГЭ","удовлетворительно  (ГЭ)","Неудовлетворительно (ГЭ)","Наименование компетенции демонстрационного экзамена","Количество студентов прошедших демонстрационный экзамен по каждой компетенции в рамках ГИА, чел."]
["05.02.01 Картография",{"$f":"IF(ISBLANK(A7),\"\",VLOOKUP(A7,'разн. списки'!$N$3:$O$274,2,FALSE))","v":"05.00.00 НАУКИ О ЗЕМЛЕ"},"Очная","Бюджет",{"$f":"SUM(F7:I7)","v":24},5,4,7,8,10,10,5,7,8,1,4,5,6]
["08.02.05 Строительство и эксплуатация автомобильных дорог и аэродромов",{"$f":"IF(ISBLANK(A8),\"\",VLOOKUP(A8,'разн. списки'!$N$3:$O$274,2,FALSE))","v":"08.00.00 ТЕХНИКА И ТЕХНОЛОГИИ СТРОИТЕЛЬСТВА"},"Очно-заочная","Внебюджет",{"$f":"SUM(F8:I8)","v":34},7,8,9,10,5,2,3,4,7,1,2,4,5]
["05.02.01 Картография",{"$f":"IF(ISBLANK(A9),\"\",VLOOKUP(A9,'разн. списки'!$N$3:$O$274,2,FALSE))","v":"05.00.00 НАУКИ О ЗЕМЛЕ"},"Заочная","Бюджет",20,5,7,4,4]
["07.02.01 Архитектура",{"$f":"IF(ISBLANK(A10),\"\",VLOOKUP(A10,'разн. списки'!$N$3:$O$274,2,FALSE))","v":"07.00.00 АРХИТЕКТУРА"},"Очно-заочная","Бюджет",24,5,7,8,4,4,45]
{"$rows_left_out":564}
{"sheet":"Ф6-9","index":6,"n_rows":106,"n_cols":14,"rows_kept":106,"cut":false,"hidden":false,"merged":[[101,0,103,0],[101,1,103,1],[101,2,102,5],[101,6,102,9],[101,10,102,13],[95,9,95,10],[95,0,96,0],[94,0,94,11],[1,0,1,8],[100,0,100,6],[6,0,6,8],[95,1,95,4],[2,6,2,8],[95,5,95,8],[2,0,3,0],[2,1,3,1],[2,2,3,2],[2,3,3,3],[2,4,3,4],[2,5,3,5]]}
[]
["Форма №6 Особенности контингента выпускников 2022 года "]
["Кол-во выпускников, получивших диплом, по всем формам обучения, чел.","Кол-во выпускников- победителей, призеров чемпионатов Ворлдскиллс, чел.","Кол-во выпускников, обучающихся по целевому договору, чел","Кол-во занятых выпускников (с учетом самозанятых), чел.","Кол-во выпускников, имеющих наставников из числа специалистов-практиков, работающих на предприятиях и организациях реального сектора экономики","Если выпускники имеют наставников из числа специалистов-практиков, работающих на предприятиях и организациях реального сектора экономики, то укажите название предприятий","Распределение выпускников по возрасту, чел."]
[null,null,null,null,null,null,"До 18 лет","От 18 до 21","От 22 до 40 лет"]
[{"$f":"SUM('Ф1-3'!B7,'Ф1-3'!B14)","v":385},10,15,{"$f":"SUM('Таб 1.1-1.2'!H16:H202)","v":203},24,null,55,30,300]
[]
["Форма №7 Информационная справка"]
["Наименование образовательной организации","Код профессии/Специальности (выберите из списка)","Кол-во обучающихся на начало обучения","Кол-во допущенных к ГИА","Кол-во не явившихся на ГИА","Кол-во получивших дипломы","Из них с отличием ","Из них на «4» и «5»","Остальные дипломы"]
[{"$f":"'Таб 1.1-1.2'!$F$2","v":"Вместо этого текста, напишите название"},"05.01.01 Гидрометнаблюдатель",100,75,10,75,25,10,{"$f":"F9-(SUM(G9:H9))","v":40}]
[{"$f":"'Таб 1.1-1.2'!$F$2","v":"Вместо этого текста, напишите название"},"08.01.04 Кровельщик",42,43,15,52,24,7,{"$f":"F10-(SUM(G10:H10))","v":21}]
{"$rows_left_out":97}
{"sheet":"Трудоустройство выпускников","index":7,"n_rows":310,"n_cols":31,"rows_kept":310,"cut":false,"hidden":false,"merged":[[0,29,3,29],[0,30,3,30],[1,4,1,9],[1,10,1,12],[1,13,1,16],[1,17,1,22],[1,23,1,28],[0,0,3,0],[0,1,3,1],[0,2,3,2],[0,3,2,3],[0,4,0,28]]}
["Код профессии, специальности*","Номер строки","Наименование показателей \n(категория выпускников)\n\n(редактирование наименовани \nне допускается)\n\n","Суммарный выпуск \nв 2022 году (человек)","Распределение выпускников по каналам занятости и иным видам деятельности, человек (каждый выпускник учитывается один раз. Единица измерения - человек)",null,null,null,null,null,null,null,null,null,null,null,null,null,null,null,null,null,null,null,null,null,null,null,null,"Принимаемые меры по содействию занятости \n\n(тезисно - вид меры, охват выпускников мерой)","ПРОВЕРКА \n\n(сумма по всем категориям выпускников, распределенных по видам занятости, должна равняться сумме выпускников всего)"]
[null,null,null,null,"Занятые выпускники",null,null,null,null,null,"Потенциальная занятость (не относится к занятости по итогам обучения, требует дополнительных мер)",null,null,"Зона риска (требует оперативных мер и адресной работы)",null,null,null,"Прочее, редкие жизненные обстоятельства",null,null,null,null,null,"Профессиональные намерения выпускников, ожидаемый эффект от работы по содействию занятости (на ближайшую перспективу - порядка 3-х месяцев)"]
[null,null,null,null,"Трудоустроены \n(по трудовому договору, договору ГПХ в соответствии с трудовым законодательством, законодательством  об обязательном пенсионном страховании)","\n\nВ том числе (из трудоустроенных): в соответствии с освоенной профессией, специальностью (исходя из осуществляемой трудовой функции)","\n\nВ том числе (из трудоустроенных): работают на протяжении не менее 4-х месяцев на последнем месте работы","Индиви-дуальные предприни-матели ","Самозанятые (перешедшие на специальный налоговый режим  - налог на профессио-нальный доход)","Продолжили обучение","Проходят службу в армии по призыву","Проходят службу в армии на контрактной основе, в органах внутренних дел, Государственной противопожарной службе, органах по контролю за оборотом наркотических средств и психотропных веществ, учреждениях и органах уголовно-исполнительной системы, войсках национальной гвардии Российской Федерации, органах принудительного исполнения Российской Федерации*","Находятся в отпуске по уходу за ребенком","Неформальная занятость (нелегальная)","Зарегистрированы в центрах занятости в качестве безработных (получают пособие по безработице) и не планируют трудоустраиваться","Не имеют мотивации к трудоустройству (кроме зарегистрированных в качестве безработных) и не планируют трудоустраиваться, в том числе по причинам получения иных социальных льгот ","Иные причины нахождения под риском нетрудоустройства","Смерть, тяжелое состояние здоровья","Находятся под следствием, отбывают наказание ","Переезд за пределы Российской Федерации\n\n(кроме переезда в иные регионы - по ним регион должен располагать сведениями)","Не могут трудоустраиваться в связи с уходом за больными родственниками, в связи с иными семейными обстоятельствами","Выпускники из числа иностранных граждан, которые не имеют СНИЛС","Иное\n \n(в первую очередь выпускники распределяются по всем остальным графам. Данная графа предназначена для очень редких случаев. Если в нее включено более 1 из 200 выпускников - укажите причины в гр. 33 ","будут трудоустроены","будут осуществлять предприни-мательскую деятельность","будут самозанятыми","будут призваны в армию","будут в армии на контрактной основе, в органах внутренних дел, Государственной противопожарной службе, органах по контролю за оборотом наркотических средств и психотропных веществ, учреждениях и органах уголовно-исполнительной системы, войсках национальной гвардии Российской Федерации, органах принудительного исполнения Российской Федерации*\n","будут продолжать обучение"]
[null,null,null,"человек","человек","человек","человек","человек","человек","человек","человек","человек","человек","человек","человек","человек","человек","человек","человек","человек","человек","человек","человек","человек","человек","человек","человек","человек","человек"]
["04","05","06","07","08","09","10","11","12","13","14","15","16","17","18","19","20","21","22","23","24","25","26","27","28","29","30","31","32","33","34"]
[null,1,"Всего  (общая численность выпускников)",null,null,null,null,null,null,null,null,null,null,null,null,null,null,null,null,null,null,null,null,null,null,null,null,null,null,null,{"$f":"SUM(H6:AC6,E6)=D6","v":true}]
[{"$f":"$A$6","v":0},2,"из общей численности выпускников (из строки 01): лица с ОВЗ",null,null,null,null,null,null,null,null,null,null,null,null,null,null,null,null,null,null,null,null,null,null,null,null,null,null,null,{"$f":"SUM(H7:AC7,E7)=D7","v":true}]
[{"$f":"$A$6","v":0},3,"из числа лиц с ОВЗ (из строки 02): инвалиды и дети-инвалиды",null,null,null,null,null,null,null,null,null,null,null,null,null,null,null,null,null,null,null,null,null,null,null,null,null,null,null,true]
[0,4,"Инвалиды и дети-инвалиды (кроме учтенных в строке 03)",null,null,null,null,null,null,null,null,null,null,null,null,null,null,null,null,null,null,null,null,null,null,null,null,null,null,null,true]
[0,5,"Имеют договор о целевом обучении",null,null,null,null,null,null,null,null,null,null,null,null,null,null,null,null,null,null,null,null,null,null,null,null,null,null,null,true]
{"$rows_left_out":301}
{"sheet":"диаграммы","index":8,"n_rows":287,"n_cols":2,"rows_kept":287,"cut":false,"hidden":false,"merged":[[245,1,245,28],[268,1,268,28],[286,1,286,28],[114,1,114,28],[146,1,146,28],[185,1,185,28],[0,1,0,28],[32,1,32,28],[48,1,48,28],[81,1,81,28],[224,1,224,28]]}
[null,"Таблица 1.1. Сравнительная таблица количественных показателей выпуска за период с 2018 по 2022 г. (Заполняет только головное учреждение)"]
[]
[]
[]
[]
[]
[]
[]
[]
[]
{"$rows_left_out":277}